{"text_format":"1","workbook":"xlsx","n_sheets":4,"sheets":["DADOS","Simulador","Apoio","Configuração de Taxas"],"not_rendered":{"charts":0,"images":4,"macros":1,"external_links":0,"defined_names":2,"comments":0,"pivot_tables":0},"unopened":[],"bounds":{"document_bytes":16777216,"sheet_cells":100000,"rows_first":2000,"rows_last":500,"rows_between":2000,"halvings":0,"cell_chars":16384,"cell_head_chars":4096},"cells_cut":0,"cells_raw":0,"read":"whole","date_system":"1900"}

{"sheet":"DADOS","index":0,"n_rows":69,"n_cols":13,"rows_kept":69,"cut":false,"hidden":true,"merged":[]}
["Possui Filhos?"]
[null,null,null,null,"Anos para Suporte"]
["Nome:",{"$f":"Simulador!D13","v":0},"Idade:",{"$f":"Simulador!G13","v":0},{"$f":"IF((Apoio!$B$1-D3)<0,0,(Apoio!$B$1-D3))","v":18},"Estuda em Escola Particular?",{"$f":"Simulador!J13","v":0},{"$f":"IF(G3=\"Sim\",\"Quanto custa?\",\"\")","v":""},{"$f":"Simulador!N13","v":0},{"$f":"IF(OR(G3=\"Não\",G3=0),\"\",CONCATENATE(\"Valor para mais \",E3,IF(E3=1,\" ano de estudo:\",\" anos de estudo: \"),TEXT(K3,\"R$0.0,00\")))","v":""},{"$f":"SUM(Apoio!B20:Z20)","v":0}]
["Nome:",{"$f":"Simulador!D15","v":0},"Idade:",{"$f":"Simulador!G15","v":0},{"$f":"IF((Apoio!$B$1-D4)<0,0,(Apoio!$B$1-D4))","v":18},"Estuda em Escola Particular?",{"$f":"Simulador!J15","v":0},{"$f":"IF(G4=\"Sim\",\"Quanto custa?\",\"\")","v":""},{"$f":"Simulador!N15","v":0},{"$f":"IF(OR(G4=\"Não\",G4=0),\"\",CONCATENATE(\"Valor para mais \",E4,IF(E4=1,\" ano de estudo:\",\" anos de estudo: \"),TEXT(K4,\"R$0.0,00\")))","v":""},{"$f":"SUM(Apoio!B25:Z25)","v":0}]
["Nome:",{"$f":"Simulador!D17","v":0},"Idade:",{"$f":"Simulador!G17","v":0},{"$f":"IF((Apoio!$B$1-D5)<0,0,(Apoio!$B$1-D5))","v":18},"Estuda em Escola Particular?",{"$f":"Simulador!J17","v":0},{"$f":"IF(G5=\"Sim\",\"Quanto custa?\",\"\")","v":""},{"$f":"Simulador!N17","v":0},{"$f":"IF(OR(G5=\"Não\",G5=0),\"\",CONCATENATE(\"Valor para mais \",E5,IF(E5=1,\" ano de estudo:\",\" anos de estudo: \"),TEXT(K5,\"R$0.0,00\")))","v":""},{"$f":"SUM(Apoio!B30:Z30)","v":0}]
["Nome:",{"$f":"Simulador!D19","v":0},"Idade:",{"$f":"Simulador!G19","v":0},{"$f":"IF((Apoio!$B$1-D6)<0,0,(Apoio!$B$1-D6))","v":18},"Estuda em Escola Particular?",{"$f":"Simulador!J19","v":0},{"$f":"IF(G6=\"Sim\",\"Quanto custa?\",\"\")","v":""},{"$f":"Simulador!N19","v":0},{"$f":"IF(OR(G6=\"Não\",G6=0),\"\",CONCATENATE(\"Valor para mais \",E6,IF(E6=1,\" ano de estudo:\",\" anos de estudo: \"),TEXT(K6,\"R$0.0,00\")))","v":""},{"$f":"SUM(Apoio!B35:Z35)","v":0}]
[null,null,null,null,null,null,null,null,null,{"$f":"IF(AND(J3=\"\",J4=\"\",J5=\"\",J6=\"\"),\"\",CONCATENATE(\"Valor para garantia do estudo \",TEXT(K7,\"R$0.0,00\")))","v":""},{"$f":"SUM(K3:K6)","v":0},{"$f":"IF(OR(K7=\"\",K7=0),\"\",CONCATENATE(\">>Para garantir o estudo dos filhos até os \",Apoio!B1,\" anos de idade: \",TEXT(DADOS!K7,\"R$0.0,00\")))","v":""}]
[]
[]
["Despesas Recorrentes",null,"Você é responsável por quanto?",{"$f":"Simulador!F25","v":1},null,{"$f":"Simulador!L25","v":0}]
[]
["Água e Esgoto",{"$f":"Simulador!D27","v":0},{"$f":"B12*$D$10","v":0},null,null,{"$f":"IF(F10>0%,\"Simular Seguro para esposa e/ou outros\",\"\")","v":""}]
["Luz",{"$f":"Simulador!D29","v":0},{"$f":"B13*$D$10","v":0}]
["Telefone",{"$f":"Simulador!D31","v":0},0]
["Internet",{"$f":"Simulador!D33","v":0},0]
["Condomínio",{"$f":"Simulador!D35","v":0},0]
["Aluguel",{"$f":"Simulador!D37","v":0},0]
["Supermercado",{"$f":"Simulador!D39","v":0},0]
["Transporte",{"$f":"Simulador!D41","v":0},0]
["Saúde",{"$f":"Simulador!D43","v":0},0]
["Outras despesas",{"$f":"Simulador!D45","v":0},0]
[null,{"$f":"SUM(B12:B21)","v":0},{"$f":"SUM(C12:C21)","v":0},null,null,null,null,null,null,{"$f":"CONCATENATE(\"Valor necessário para mais \",Apoio!B3,\" anos: \",TEXT(K22,\"R$0.0,00\"))","v":"Valor necessário para mais 5 anos: R$00,00"},{"$f":"SUM(Apoio!B41:Z41)","v":0},{"$f":"IF(K22>0,4,0)","v":0},{"$f":"IF(OR(K22=0,K22=\"\"),\"\",CONCATENATE(\">>Para garantir uma renda por mais \",Apoio!B3,\" anos, para despesas mensais: \",TEXT(DADOS!K22,\"R$0.0,00\")))","v":""}]
[]
[]
[]
["Patrimônio no seu nome"]
[]
["Carro",{"$f":"Simulador!D52","v":0}]
["Moto",{"$f":"Simulador!D54","v":0}]
["Caminhão",{"$f":"Simulador!D56","v":0}]
["Casa",{"$f":"Simulador!D58","v":0}]
["Terreno",{"$f":"Simulador!D60","v":0}]
["Chácara",{"$f":"Simulador!D62","v":0}]
["Propriedade Rural",{"$f":"Simulador!D64","v":0}]
["Outros bens",{"$f":"Simulador!D66","v":0}]
["Total",{"$f":"SUM(B28:B35)","v":0}]
["Inventário",{"$f":"SUM(B28:B35)*Apoio!B13","v":0},null,null,null,null,null,null,null,{"$f":"CONCATENATE(\"Valor necessário para inventário: \",TEXT(K37,\"R$0.0,00\"))","v":"Valor necessário para inventário: R$00,00"},{"$f":"B37","v":0},{"$f":"IF(K37>0,4,0)","v":0},{"$f":"IF(OR(K37=0,K37=\"\"),\"\",CONCATENATE(\">>Para garantir os gastos com invetários das transferencias dos seus bens: \",TEXT(DADOS!K37,\"R$0.0,00\")))","v":""}]
[]
[]
["Valor proposto de cobertura",null,null,null,null,null,null,null,null,null,{"$f":"K7+K22+K37","v":0},null,{"$f":"CONCATENATE(\"Valor de cobertura de Seguro de vida proposto de acordo com sua necessidade: \",TEXT(DADOS!K40,\"R$0.0,00\"))","v":"Valor de cobertura de Seguro de vida proposto de acordo com sua necessidade: R$00,00"}]
[]
[]
[]
[]
[]
[]
["Simulação de Previdência"]
["Faculdade","Valor mensal hoje","Tempo do Curso","Idade atual do beneficiado?",{"$f":"CONCATENATE(\"Inicia daqui a: \",E49,\" anos\")","v":"Inicia daqui a: 18 anos"},"Valor futuro necessário",null,"Investimento Mensal na Previdência"]
[{"$f":"Simulador!D87","v":0},{"$f":"Simulador!D89","v":0},{"$f":"Simulador!D91","v":0},{"$f":"Simulador!D93","v":0},{"$f":"IF((Apoio!B5-D49)<0,0,IF(D49>=18,1,Apoio!B5-D49))","v":18},{"$f":"SUM(Apoio!B48:Z48)","v":0},null,{"$f":"IF(E49=\"\",\"\",PMT(tx_prev/12,E49*12,,-F49))","v":0}]
[null,null,null,null,{"$f":"IF(B49=0,\"\",CONCATENATE(\"Tempo de investimento: \",DADOS!E49,IF(DADOS!E49=1,\" Ano\",\" Anos\")))","v":""},{"$f":"IF(B49=0,\"\",CONCATENATE(\"Valor futuro necessário para a conclusão do Curso: \",TEXT(DADOS!F49,\"R$0.0,00\")))","v":""},null,{"$f":"IF(B49=0,\"\",CONCATENATE(\"Investimento mensal na Previdência: \",TEXT(DADOS!H49,\"R$0.0,00\")))","v":""}]
[]
[]
["Comparação com Previdência Social"]
["Nome","Idade","Sexo","Salário","Contribução INSS (Teto)","Tempo contribuído","Tempo restante de Contribuíção","Pontos","Pontos Restantes","Tipo de Contribuinte","Idade de aposentadoria","Retorno Previsto"]
[{"$f":"Simulador!D5","v":0},{"$f":"Simulador!I5","v":0},{"$f":"Simulador!N5","v":0},{"$f":"Simulador!I7","v":0},{"$f":"IF(OR(J55=0,D55=0),\"\",IF(AND(OR(J55=\"Individual\",J55=\"Facultativo\"),D55>$B$69),$B$69*20%,IF(OR(J55=\"Individual\",J55=\"Facultativo\"),D55*20%,IF(D55>B69,B69*11%,VLOOKUP(D55,$A$63:$C$66,2)*D55))))","v":""},{"$f":"IF(B55=0,\"\",IF(B55<16,0,B55-18))","v":""},{"$f":"IF(OR(C55=0,B55=0),\"\",IF(AND(C55=\"Masculino\",F55>=35),0,IF(AND(C55=\"Feminino\",F55>=30),0,IF(OR(C55=\"Masculino\",C55=0),35-F55,30-F55))))","v":""},{"$f":"IF(F55=\"\",\"\",B55+F55)","v":""},{"$f":"IF(H55=\"\",\"\",IF(C55=0,\"Informe o Sexo!\",IF(IF(C55=\"Masculino\",100-H55,IF(C55=\"Feminino\",80-H55))<0,0,IF(C55=\"Masculino\",100-H55,IF(C55=\"Feminino\",80-H55)))))","v":""},{"$f":"Simulador!N7","v":0},{"$f":"IF(IF(OR(B55=0,G55=\"\"),\"\",B55+G55)<50,50,IF(OR(B55=0,G55=\"\"),\"\",B55+G55))","v":""},{"$f":"IF(J55=0,\"\",IF(K55=\"\",\"\",IF(D55>B69,B69*80%,D55*80%)*VLOOKUP(K55,Apoio!$A$54:$B$65,2)))","v":""}]
[null,null,null,null,{"$f":"IF(E55=\"\",\"Dados pessoais incompletos\",IF(E55=0,\"\",CONCATENATE(\"Valor pago atual: \",TEXT(DADOS!E55,\"R$0.0,00\"))))","v":"Dados pessoais incompletos"},null,{"$f":"IF(G55=\"\",\"\",IF(G55=0,\"\",CONCATENATE(\"Tempo restante: \",DADOS!G55,IF(DADOS!G55=1,\" Ano\",\" Anos\"))))","v":""},null,{"$f":"IF(I55=\"Informe o Sexo!\",\"Informe o Sexo!\",\"\")","v":""},null,null,{"$f":"IF(L55=\"\",\"\",IF(L55=0,\"\",CONCATENATE(\"Benefício previsto de \",TEXT(L55,\"R$0.0,00\"),\" por mês\")))","v":""}]
[]
["Valor Futuro Previdência Privada","Idade desejada para aposentadoria?","Valor de investimento","Reserva Acumulada","Tempo de Benefício","Benefício Mensal"]
[null,{"$f":"Simulador!D104","v":0},{"$f":"Simulador!D108","v":0},{"$f":"IF(B55=0,\"Informe a sua idade!\",-FV(tx_prev/12,(B59-B55)*12,C59))","v":"Informe a sua idade!"},{"$f":"Simulador!D106","v":0},{"$f":"IF(OR(D59=0,D59=\"Informe a sua idade!\"),0,-PMT(tx_prev/12,E59*12,,D59))","v":0},null,null,null,{"$f":"IF(OR(B59=0,K59=\"\"),\"\",IF(OR(D55=0,C55=0),\"\",CONCATENATE(\"Investindo os mesmos \",TEXT(E55,\"R$0.0,00\"),\" por \",IF(DADOS!G55=0,B59-B55,DADOS!G55),IF(IF(DADOS!G55=0,B59-B55,DADOS!G55)=1,\" Ano\",\" Anos\"),\" na Previdência Privada você terá um montante de: \",TEXT(K59,\"R$0.0,00\"),\".\")))","v":""},{"$f":"IF(OR(B55=0,E55=\"\",G55=\"\"),\"\",-FV(tx_prev/12,IF(G55=0,(B59-B55)*12,G55*12),E55))","v":""},null,{"$f":"IF(K59=\"\",\"\",IF(E59=0,\"\",-PMT(tx_prev/12,E59*12,,K59)))","v":""}]
[null,null,null,{"$f":"IF(OR(B55=\"\",B55=0),\"Informe a sua idade atual!\",IF(B59=0,\"\",CONCATENATE(\"Reserva acumulada em \",B59-B55,IF(B59-B55=1,\" Ano: \",\" Anos: \"),TEXT(D59,\"R$0.0,00\"))))","v":"Informe a sua idade atual!"},null,{"$f":"IF(B59=0,\"\",IF(OR(E59=\"\",E59=0),\"Informe o período desejado\",IF(B59=0,\"\",CONCATENATE(\"Garantindo uma renda mensal de \",TEXT(F59,\"R$0.0,00\"),\" por \",E59,IF(E59=1,\" Ano \",\" Anos \")))))","v":""},null,null,null,{"$f":"IF(M59=\"\",\"\",IF(OR(D55=0,C55=0),\"\",CONCATENATE(\"Você terá uma renda complementar mensal de \",TEXT(M59,\"R$0.0,00\"),\" por \",E59,IF(E59=1,\" Ano.\",\" Anos.\"))))","v":""}]
[null,null,null,null,null,null,null,null,null,{"$f":"IF(OR(J55=\"\",J55=0),\"Tipo contribuinte INSS não informado!\",CONCATENATE(\"*Base de cálculo: Contribuinte \",J55,\" \",,IF(AND(J55=\"Empregado (obrigatório)\",D55>B69),CONCATENATE(\"com 11% sobre teto da previdência.\"),IF(J55=\"Empregado (obrigatório)\",CONCATENATE(TEXT(VLOOKUP(D55,$A$63:$B$66,2),\"0%\"),\" sobre o salário.\"),IF(AND(OR(J55=\"Facultativo\",J55=\"Individual\"),D55>B69),\"com 20% sobre o teto da previdência.\",IF(OR(J55=\"Facultativo\",J55=\"Individual\"),\"com 20% sobre a renda.\"))))))","v":"Tipo contribuinte INSS não informado!"}]
[]
["Tabela Empregado de Carteira","Piso"]
[0,0.08]
[1751.82,0.09]
[2919.73,0.11]
[]
["Salário Mínimo",998]
["Teto da Previdência",5645.8]

{"sheet":"Simulador","index":1,"n_rows":120,"n_cols":12,"rows_kept":120,"cut":false,"hidden":false,"merged":[]}
[null,2]
[null,2]
[]
[]
[null,"Nome:",null,null,null,null,"Idade:",null,null,null,null,"Sexo"]
[]
[null,"Profissão:",null,null,null,null,"Renda Mensal:",null,null,null,null,"Tipo de contribuinte INSS?"]
[]
[]
[]
[]
[]
[null,"Nome do 1º Filho",null,null,null,"Idade",null,null,"Estuda em colégio Particular?"]
[]
[null,"Nome do 2º Filho",null,null,null,"Idade",null,null,"Estuda em colégio Particular?"]
[]
[null,"Nome do 3º Filho",null,null,null,"Idade",null,null,"Estuda em colégio Particular?"]
[]
[null,"Nome do 4º Filho",null,null,null,"Idade",null,null,"Estuda em colégio Particular?"]
[]
[]
[]
[]
[null,"Despesas Gerais Mensais"]
[null,null,null,"Qual a sua participação no Orçamento familiar:",null,1,null,"Participação de sua esposa e/ou outros:",null,null,null,0]
[]
[null,"Água e Esgoto"]
[]
[null,"Luz"]
[]
[null,"Telefone"]
[]
[null,"Internet"]
[]
[null,"Condomínio"]
[]
[null,"Aluguel"]
[]
[null,"Supermercado"]
[]
[null,"Transporte"]
[]
[null,"Saúde"]
[]
[null,"Outras despesas"]
[]
[null,"Total gasto mensal:"]
[]
[]
[null,"Patrimônio no seu nome"]
[]
[null,"Carro"]
[]
[null,"Moto"]
[]
[null,"Caminhão"]
[]
[null,"Casa"]
[]
[null,"Terreno"]
[]
[null,"Chácara"]
[]
[null,"Propriedade Rural"]
[]
[null,"Outros bens"]
[]
[]
[null,"Total do Patrimônio:",null,{"$f":"SUM(D52,D54,D56,D58,D60,D62,D64,D66)","v":0}]
[]
[]
[null,"Proposta Final para cobertura do seu Seguro de Vida:"]
[]
[]
[]
[]
[]
[]
[]
[]
[]
[]
[]
[]
[]
[]
[null,"Qual o Curso desejado?"]
[]
[null,"Qual o valor da mensalidade hoje?"]
[]
[null,"Qual tempo do Curso (em anos)?"]
[]
[null,"Qual a idade atual do beneficiado?"]
[]
[]
[]
[]
[]
[]
[]
[]
[]
[]
[null,"Idade desejada para aposentadoria?"]
[]
[null,"Receberá o benefício por quanto tempo (anos)?"]
[]
[null,"Investimento Mensal desejado?"]
[]
[]
[]
[null,"Comparativo com Previdência Social x Previdência Privada (Aposentadoria por tempo de Contribuição)"]
[]
[]
[]
[]
[]
[]
[]
[null,"* a estimativa leva em conta que a pessoa contribui com o INSS desde os 18 anos de idade."]

{"sheet":"Apoio","index":2,"n_rows":65,"n_cols":26,"rows_kept":65,"cut":false,"hidden":true,"merged":[]}
["Idade de Emancipação do filho (em anos):",{"$f":"'Configuração de Taxas'!$C$3","v":18},null,null,"Sim",{"$f":"CONCATENATE(\"* Idade estimada para emancipação dos filhos: \",B1, IF(B1=1,\"Ano\",\" Anos\"))","v":"* Idade estimada para emancipação dos filhos: 18 Anos"}]
[null,null,null,null,"Não"]
["Período para Estabilização Familiar (em anos):",{"$f":"'Configuração de Taxas'!$C$5","v":5},null,null,null,{"$f":"CONCATENATE(\"* Período estimado para estabilização Familiar: \",B3, IF(B3=1,\"Ano\",\" Anos\"))","v":"* Período estimado para estabilização Familiar: 5 Anos"}]
[]
["Idade para início da Faculdade (em anos):",{"$f":"'Configuração de Taxas'!$C$7","v":18},null,null,null,{"$f":"CONCATENATE(\"Idade estimada para início da Faculdade do benfíciado: \",B5, IF(B5=1,\"Ano\",\" Anos\"))","v":"Idade estimada para início da Faculdade do benfíciado: 18 Anos"}]
[]
["Inflação",{"$f":"'Configuração de Taxas'!$C$9","v":0.04},null,null,null,{"$f":"CONCATENATE(\"* Taxa de inflação aplicada no cálculo: \",TEXT(B7,\"0,0%\"))","v":"* Taxa de inflação aplicada no cálculo: 4,0%"}]
["IGP-M",{"$f":"'Configuração de Taxas'!$C$10","v":0.06}]
["IPCA",{"$f":"'Configuração de Taxas'!$C$11","v":0.06}]
[]
["Rentabilidade no Ano (prev)",{"$f":"'Configuração de Taxas'!$C$13","v":7.0000000000000007E-2},null,null,null,{"$f":"CONCATENATE(\"* Taxa de rentabilidade da Previdência Privada: \",TEXT(B11,\"0,0%\"))","v":"* Taxa de rentabilidade da Previdência Privada: 7,0%"}]
[]
["Taxa de inventário (despesa de inventário)",{"$f":"'Configuração de Taxas'!$C$15","v":0.08},null,null,null,{"$f":"CONCATENATE(\"* Taxa estimada para criação de Inventário : \",TEXT(B13,\"0,0%\"))","v":"* Taxa estimada para criação de Inventário : 8,0%"}]
[]
[]
[]
["Filho 1",{"$f":"IF(DADOS!$E$3<=0,0,1)","v":1},{"$f":"IFERROR(IF((B17+C18-B18)>DADOS!$E$3,\"\",B17+C18-B18),\"\")","v":2},{"$f":"IFERROR(IF((C17+D18-C18)>DADOS!$E$3,\"\",C17+D18-C18),\"\")","v":3},{"$f":"IFERROR(IF((D17+E18-D18)>DADOS!$E$3,\"\",D17+E18-D18),\"\")","v":4},{"$f":"IFERROR(IF((E17+F18-E18)>DADOS!$E$3,\"\",E17+F18-E18),\"\")","v":5},{"$f":"IFERROR(IF((F17+G18-F18)>DADOS!$E$3,\"\",F17+G18-F18),\"\")","v":6},{"$f":"IFERROR(IF((G17+H18-G18)>DADOS!$E$3,\"\",G17+H18-G18),\"\")","v":7},{"$f":"IFERROR(IF((H17+I18-H18)>DADOS!$E$3,\"\",H17+I18-H18),\"\")","v":8},{"$f":"IFERROR(IF((I17+J18-I18)>DADOS!$E$3,\"\",I17+J18-I18),\"\")","v":9},{"$f":"IFERROR(IF((J17+K18-J18)>DADOS!$E$3,\"\",J17+K18-J18),\"\")","v":10},{"$f":"IFERROR(IF((K17+L18-K18)>DADOS!$E$3,\"\",K17+L18-K18),\"\")","v":11},{"$f":"IFERROR(IF((L17+M18-L18)>DADOS!$E$3,\"\",L17+M18-L18),\"\")","v":12},{"$f":"IFERROR(IF((M17+N18-M18)>DADOS!$E$3,\"\",M17+N18-M18),\"\")","v":13},{"$f":"IFERROR(IF((N17+O18-N18)>DADOS!$E$3,\"\",N17+O18-N18),\"\")","v":14},{"$f":"IFERROR(IF((O17+P18-O18)>DADOS!$E$3,\"\",O17+P18-O18),\"\")","v":15},{"$f":"IFERROR(IF((P17+Q18-P18)>DADOS!$E$3,\"\",P17+Q18-P18),\"\")","v":16},{"$f":"IFERROR(IF((Q17+R18-Q18)>DADOS!$E$3,\"\",Q17+R18-Q18),\"\")","v":17},{"$f":"IFERROR(IF((R17+S18-R18)>DADOS!$E$3,\"\",R17+S18-R18),\"\")","v":18},{"$f":"IFERROR(IF((S17+T18-S18)>DADOS!$E$3,\"\",S17+T18-S18),\"\")","v":""},{"$f":"IFERROR(IF((T17+U18-T18)>DADOS!$E$3,\"\",T17+U18-T18),\"\")","v":""},{"$f":"IFERROR(IF((U17+V18-U18)>DADOS!$E$3,\"\",U17+V18-U18),\"\")","v":""},{"$f":"IFERROR(IF((V17+W18-V18)>DADOS!$E$3,\"\",V17+W18-V18),\"\")","v":""},{"$f":"IFERROR(IF((W17+X18-W18)>DADOS!$E$3,\"\",W17+X18-W18),\"\")","v":""},{"$f":"IFERROR(IF((X17+Y18-X18)>DADOS!$E$3,\"\",X17+Y18-X18),\"\")","v":""},{"$f":"IFERROR(IF((Y17+Z18-Y18)>DADOS!$E$3,\"\",Y17+Z18-Y18),\"\")","v":""}]
[null,1,{"$f":"IFERROR(IF(B18+1>Apoio!$B$1,\"\",B18+1),\"\")","v":2},{"$f":"IFERROR(IF(C18+1>Apoio!$B$1,\"\",C18+1),\"\")","v":3},{"$f":"IFERROR(IF(D18+1>Apoio!$B$1,\"\",D18+1),\"\")","v":4},{"$f":"IFERROR(IF(E18+1>Apoio!$B$1,\"\",E18+1),\"\")","v":5},{"$f":"IFERROR(IF(F18+1>Apoio!$B$1,\"\",F18+1),\"\")","v":6},{"$f":"IFERROR(IF(G18+1>Apoio!$B$1,\"\",G18+1),\"\")","v":7},{"$f":"IFERROR(IF(H18+1>Apoio!$B$1,\"\",H18+1),\"\")","v":8},{"$f":"IFERROR(IF(I18+1>Apoio!$B$1,\"\",I18+1),\"\")","v":9},{"$f":"IFERROR(IF(J18+1>Apoio!$B$1,\"\",J18+1),\"\")","v":10},{"$f":"IFERROR(IF(K18+1>Apoio!$B$1,\"\",K18+1),\"\")","v":11},{"$f":"IFERROR(IF(L18+1>Apoio!$B$1,\"\",L18+1),\"\")","v":12},{"$f":"IFERROR(IF(M18+1>Apoio!$B$1,\"\",M18+1),\"\")","v":13},{"$f":"IFERROR(IF(N18+1>Apoio!$B$1,\"\",N18+1),\"\")","v":14},{"$f":"IFERROR(IF(O18+1>Apoio!$B$1,\"\",O18+1),\"\")","v":15},{"$f":"IFERROR(IF(P18+1>Apoio!$B$1,\"\",P18+1),\"\")","v":16},{"$f":"IFERROR(IF(Q18+1>Apoio!$B$1,\"\",Q18+1),\"\")","v":17},{"$f":"IFERROR(IF(R18+1>Apoio!$B$1,\"\",R18+1),\"\")","v":18},{"$f":"IFERROR(IF(S18+1>Apoio!$B$1,\"\",S18+1),\"\")","v":""},{"$f":"IFERROR(IF(T18+1>Apoio!$B$1,\"\",T18+1),\"\")","v":""},{"$f":"IFERROR(IF(U18+1>Apoio!$B$1,\"\",U18+1),\"\")","v":""},{"$f":"IFERROR(IF(V18+1>Apoio!$B$1,\"\",V18+1),\"\")","v":""},{"$f":"IFERROR(IF(W18+1>Apoio!$B$1,\"\",W18+1),\"\")","v":""},{"$f":"IFERROR(IF(X18+1>Apoio!$B$1,\"\",X18+1),\"\")","v":""},{"$f":"IFERROR(IF(Y18+1>Apoio!$B$1,\"\",Y18+1),\"\")","v":""}]
[null,{"$f":"IF(OR(B17=\"\",B17=0),\"\",FV(inflacao,B17-1,0,DADOS!$I$3*-1))","v":0},{"$f":"IF(OR(C17=\"\",C17=0),\"\",FV(inflacao,C17-1,0,DADOS!$I$3*-1))","v":0},{"$f":"IF(OR(D17=\"\",D17=0),\"\",FV(inflacao,D17-1,0,DADOS!$I$3*-1))","v":0},{"$f":"IF(OR(E17=\"\",E17=0),\"\",FV(inflacao,E17-1,0,DADOS!$I$3*-1))","v":0},{"$f":"IF(OR(F17=\"\",F17=0),\"\",FV(inflacao,F17-1,0,DADOS!$I$3*-1))","v":0},{"$f":"IF(OR(G17=\"\",G17=0),\"\",FV(inflacao,G17-1,0,DADOS!$I$3*-1))","v":0},{"$f":"IF(OR(H17=\"\",H17=0),\"\",FV(inflacao,H17-1,0,DADOS!$I$3*-1))","v":0},{"$f":"IF(OR(I17=\"\",I17=0),\"\",FV(inflacao,I17-1,0,DADOS!$I$3*-1))","v":0},{"$f":"IF(OR(J17=\"\",J17=0),\"\",FV(inflacao,J17-1,0,DADOS!$I$3*-1))","v":0},{"$f":"IF(OR(K17=\"\",K17=0),\"\",FV(inflacao,K17-1,0,DADOS!$I$3*-1))","v":0},{"$f":"IF(OR(L17=\"\",L17=0),\"\",FV(inflacao,L17-1,0,DADOS!$I$3*-1))","v":0},{"$f":"IF(OR(M17=\"\",M17=0),\"\",FV(inflacao,M17-1,0,DADOS!$I$3*-1))","v":0},{"$f":"IF(OR(N17=\"\",N17=0),\"\",FV(inflacao,N17-1,0,DADOS!$I$3*-1))","v":0},{"$f":"IF(OR(O17=\"\",O17=0),\"\",FV(inflacao,O17-1,0,DADOS!$I$3*-1))","v":0},{"$f":"IF(OR(P17=\"\",P17=0),\"\",FV(inflacao,P17-1,0,DADOS!$I$3*-1))","v":0},{"$f":"IF(OR(Q17=\"\",Q17=0),\"\",FV(inflacao,Q17-1,0,DADOS!$I$3*-1))","v":0},{"$f":"IF(OR(R17=\"\",R17=0),\"\",FV(inflacao,R17-1,0,DADOS!$I$3*-1))","v":0},{"$f":"IF(OR(S17=\"\",S17=0),\"\",FV(inflacao,S17-1,0,DADOS!$I$3*-1))","v":0},{"$f":"IF(OR(T17=\"\",T17=0),\"\",FV(inflacao,T17-1,0,DADOS!$I$3*-1))","v":""},{"$f":"IF(OR(U17=\"\",U17=0),\"\",FV(inflacao,U17-1,0,DADOS!$I$3*-1))","v":""},{"$f":"IF(OR(V17=\"\",V17=0),\"\",FV(inflacao,V17-1,0,DADOS!$I$3*-1))","v":""},{"$f":"IF(OR(W17=\"\",W17=0),\"\",FV(inflacao,W17-1,0,DADOS!$I$3*-1))","v":""},{"$f":"IF(OR(X17=\"\",X17=0),\"\",FV(inflacao,X17-1,0,DADOS!$I$3*-1))","v":""},{"$f":"IF(OR(Y17=\"\",Y17=0),\"\",FV(inflacao,Y17-1,0,DADOS!$I$3*-1))","v":""},{"$f":"IF(OR(Z17=\"\",Z17=0),\"\",FV(inflacao,Z17-1,0,DADOS!$I$3*-1))","v":""}]
[null,{"$f":"IFERROR(B19*12,\"\")","v":0},0,0,0,0,0,0,0,0,0,0,0,0,0,0,0,0,0,"","","","","","",""]
[]
["Filho 2",{"$f":"IF(DADOS!$E$4<=0,0,1)","v":1},{"$f":"IFERROR(IF((B22+C23-B23)>DADOS!$E$4,\"\",B22+C23-B23),\"\")","v":2},{"$f":"IFERROR(IF((C22+D23-C23)>DADOS!$E$4,\"\",C22+D23-C23),\"\")","v":3},{"$f":"IFERROR(IF((D22+E23-D23)>DADOS!$E$4,\"\",D22+E23-D23),\"\")","v":4},{"$f":"IFERROR(IF((E22+F23-E23)>DADOS!$E$4,\"\",E22+F23-E23),\"\")","v":5},{"$f":"IFERROR(IF((F22+G23-F23)>DADOS!$E$4,\"\",F22+G23-F23),\"\")","v":6},{"$f":"IFERROR(IF((G22+H23-G23)>DADOS!$E$4,\"\",G22+H23-G23),\"\")","v":7},{"$f":"IFERROR(IF((H22+I23-H23)>DADOS!$E$4,\"\",H22+I23-H23),\"\")","v":8},{"$f":"IFERROR(IF((I22+J23-I23)>DADOS!$E$4,\"\",I22+J23-I23),\"\")","v":9},{"$f":"IFERROR(IF((J22+K23-J23)>DADOS!$E$4,\"\",J22+K23-J23),\"\")","v":10},{"$f":"IFERROR(IF((K22+L23-K23)>DADOS!$E$4,\"\",K22+L23-K23),\"\")","v":11},{"$f":"IFERROR(IF((L22+M23-L23)>DADOS!$E$4,\"\",L22+M23-L23),\"\")","v":12},{"$f":"IFERROR(IF((M22+N23-M23)>DADOS!$E$4,\"\",M22+N23-M23),\"\")","v":13},{"$f":"IFERROR(IF((N22+O23-N23)>DADOS!$E$4,\"\",N22+O23-N23),\"\")","v":14},{"$f":"IFERROR(IF((O22+P23-O23)>DADOS!$E$4,\"\",O22+P23-O23),\"\")","v":15},{"$f":"IFERROR(IF((P22+Q23-P23)>DADOS!$E$4,\"\",P22+Q23-P23),\"\")","v":16},{"$f":"IFERROR(IF((Q22+R23-Q23)>DADOS!$E$4,\"\",Q22+R23-Q23),\"\")","v":17},{"$f":"IFERROR(IF((R22+S23-R23)>DADOS!$E$4,\"\",R22+S23-R23),\"\")","v":18},{"$f":"IFERROR(IF((S22+T23-S23)>DADOS!$E$4,\"\",S22+T23-S23),\"\")","v":""},{"$f":"IFERROR(IF((T22+U23-T23)>DADOS!$E$4,\"\",T22+U23-T23),\"\")","v":""},{"$f":"IFERROR(IF((U22+V23-U23)>DADOS!$E$4,\"\",U22+V23-U23),\"\")","v":""},{"$f":"IFERROR(IF((V22+W23-V23)>DADOS!$E$4,\"\",V22+W23-V23),\"\")","v":""},{"$f":"IFERROR(IF((W22+X23-W23)>DADOS!$E$4,\"\",W22+X23-W23),\"\")","v":""},{"$f":"IFERROR(IF((X22+Y23-X23)>DADOS!$E$4,\"\",X22+Y23-X23),\"\")","v":""},{"$f":"IFERROR(IF((Y22+Z23-Y23)>DADOS!$E$4,\"\",Y22+Z23-Y23),\"\")","v":""}]
[null,1,{"$f":"IFERROR(IF(B23+1>Apoio!$B$1,\"\",B23+1),\"\")","v":2},{"$f":"IFERROR(IF(C23+1>Apoio!$B$1,\"\",C23+1),\"\")","v":3},{"$f":"IFERROR(IF(D23+1>Apoio!$B$1,\"\",D23+1),\"\")","v":4},{"$f":"IFERROR(IF(E23+1>Apoio!$B$1,\"\",E23+1),\"\")","v":5},{"$f":"IFERROR(IF(F23+1>Apoio!$B$1,\"\",F23+1),\"\")","v":6},{"$f":"IFERROR(IF(G23+1>Apoio!$B$1,\"\",G23+1),\"\")","v":7},{"$f":"IFERROR(IF(H23+1>Apoio!$B$1,\"\",H23+1),\"\")","v":8},{"$f":"IFERROR(IF(I23+1>Apoio!$B$1,\"\",I23+1),\"\")","v":9},{"$f":"IFERROR(IF(J23+1>Apoio!$B$1,\"\",J23+1),\"\")","v":10},{"$f":"IFERROR(IF(K23+1>Apoio!$B$1,\"\",K23+1),\"\")","v":11},{"$f":"IFERROR(IF(L23+1>Apoio!$B$1,\"\",L23+1),\"\")","v":12},{"$f":"IFERROR(IF(M23+1>Apoio!$B$1,\"\",M23+1),\"\")","v":13},{"$f":"IFERROR(IF(N23+1>Apoio!$B$1,\"\",N23+1),\"\")","v":14},{"$f":"IFERROR(IF(O23+1>Apoio!$B$1,\"\",O23+1),\"\")","v":15},{"$f":"IFERROR(IF(P23+1>Apoio!$B$1,\"\",P23+1),\"\")","v":16},{"$f":"IFERROR(IF(Q23+1>Apoio!$B$1,\"\",Q23+1),\"\")","v":17},{"$f":"IFERROR(IF(R23+1>Apoio!$B$1,\"\",R23+1),\"\")","v":18},{"$f":"IFERROR(IF(S23+1>Apoio!$B$1,\"\",S23+1),\"\")","v":""},{"$f":"IFERROR(IF(T23+1>Apoio!$B$1,\"\",T23+1),\"\")","v":""},{"$f":"IFERROR(IF(U23+1>Apoio!$B$1,\"\",U23+1),\"\")","v":""},{"$f":"IFERROR(IF(V23+1>Apoio!$B$1,\"\",V23+1),\"\")","v":""},{"$f":"IFERROR(IF(W23+1>Apoio!$B$1,\"\",W23+1),\"\")","v":""},{"$f":"IFERROR(IF(X23+1>Apoio!$B$1,\"\",X23+1),\"\")","v":""},{"$f":"IFERROR(IF(Y23+1>Apoio!$B$1,\"\",Y23+1),\"\")","v":""}]
[null,{"$f":"IF(OR(B22=\"\",B22=0),\"\",FV(inflacao,B22-1,0,DADOS!$I$4*-1))","v":0},{"$f":"IF(OR(C22=\"\",C22=0),\"\",FV(inflacao,C22-1,0,DADOS!$I$4*-1))","v":0},{"$f":"IF(OR(D22=\"\",D22=0),\"\",FV(inflacao,D22-1,0,DADOS!$I$4*-1))","v":0},{"$f":"IF(OR(E22=\"\",E22=0),\"\",FV(inflacao,E22-1,0,DADOS!$I$4*-1))","v":0},{"$f":"IF(OR(F22=\"\",F22=0),\"\",FV(inflacao,F22-1,0,DADOS!$I$4*-1))","v":0},{"$f":"IF(OR(G22=\"\",G22=0),\"\",FV(inflacao,G22-1,0,DADOS!$I$4*-1))","v":0},{"$f":"IF(OR(H22=\"\",H22=0),\"\",FV(inflacao,H22-1,0,DADOS!$I$4*-1))","v":0},{"$f":"IF(OR(I22=\"\",I22=0),\"\",FV(inflacao,I22-1,0,DADOS!$I$4*-1))","v":0},{"$f":"IF(OR(J22=\"\",J22=0),\"\",FV(inflacao,J22-1,0,DADOS!$I$4*-1))","v":0},{"$f":"IF(OR(K22=\"\",K22=0),\"\",FV(inflacao,K22-1,0,DADOS!$I$4*-1))","v":0},{"$f":"IF(OR(L22=\"\",L22=0),\"\",FV(inflacao,L22-1,0,DADOS!$I$4*-1))","v":0},{"$f":"IF(OR(M22=\"\",M22=0),\"\",FV(inflacao,M22-1,0,DADOS!$I$4*-1))","v":0},{"$f":"IF(OR(N22=\"\",N22=0),\"\",FV(inflacao,N22-1,0,DADOS!$I$4*-1))","v":0},{"$f":"IF(OR(O22=\"\",O22=0),\"\",FV(inflacao,O22-1,0,DADOS!$I$4*-1))","v":0},{"$f":"IF(OR(P22=\"\",P22=0),\"\",FV(inflacao,P22-1,0,DADOS!$I$4*-1))","v":0},{"$f":"IF(OR(Q22=\"\",Q22=0),\"\",FV(inflacao,Q22-1,0,DADOS!$I$4*-1))","v":0},{"$f":"IF(OR(R22=\"\",R22=0),\"\",FV(inflacao,R22-1,0,DADOS!$I$4*-1))","v":0},{"$f":"IF(OR(S22=\"\",S22=0),\"\",FV(inflacao,S22-1,0,DADOS!$I$4*-1))","v":0},{"$f":"IF(OR(T22=\"\",T22=0),\"\",FV(inflacao,T22-1,0,DADOS!$I$4*-1))","v":""},{"$f":"IF(OR(U22=\"\",U22=0),\"\",FV(inflacao,U22-1,0,DADOS!$I$4*-1))","v":""},{"$f":"IF(OR(V22=\"\",V22=0),\"\",FV(inflacao,V22-1,0,DADOS!$I$4*-1))","v":""},{"$f":"IF(OR(W22=\"\",W22=0),\"\",FV(inflacao,W22-1,0,DADOS!$I$4*-1))","v":""},{"$f":"IF(OR(X22=\"\",X22=0),\"\",FV(inflacao,X22-1,0,DADOS!$I$4*-1))","v":""},{"$f":"IF(OR(Y22=\"\",Y22=0),\"\",FV(inflacao,Y22-1,0,DADOS!$I$4*-1))","v":""},{"$f":"IF(OR(Z22=\"\",Z22=0),\"\",FV(inflacao,Z22-1,0,DADOS!$I$4*-1))","v":""}]
[null,{"$f":"IFERROR(B24*12,\"\")","v":0},0,0,0,0,0,0,0,0,0,0,0,0,0,0,0,0,0,"","","","","","",""]
[]
["Filho 3",{"$f":"IF(DADOS!$E$5<=0,0,1)","v":1},{"$f":"IFERROR(IF((B27+C28-B28)>DADOS!$E$5,\"\",B27+C28-B28),\"\")","v":2},{"$f":"IFERROR(IF((C27+D28-C28)>DADOS!$E$5,\"\",C27+D28-C28),\"\")","v":3},{"$f":"IFERROR(IF((D27+E28-D28)>DADOS!$E$5,\"\",D27+E28-D28),\"\")","v":4},{"$f":"IFERROR(IF((E27+F28-E28)>DADOS!$E$5,\"\",E27+F28-E28),\"\")","v":5},{"$f":"IFERROR(IF((F27+G28-F28)>DADOS!$E$5,\"\",F27+G28-F28),\"\")","v":6},{"$f":"IFERROR(IF((G27+H28-G28)>DADOS!$E$5,\"\",G27+H28-G28),\"\")","v":7},{"$f":"IFERROR(IF((H27+I28-H28)>DADOS!$E$5,\"\",H27+I28-H28),\"\")","v":8},{"$f":"IFERROR(IF((I27+J28-I28)>DADOS!$E$5,\"\",I27+J28-I28),\"\")","v":9},{"$f":"IFERROR(IF((J27+K28-J28)>DADOS!$E$5,\"\",J27+K28-J28),\"\")","v":10},{"$f":"IFERROR(IF((K27+L28-K28)>DADOS!$E$5,\"\",K27+L28-K28),\"\")","v":11},{"$f":"IFERROR(IF((L27+M28-L28)>DADOS!$E$5,\"\",L27+M28-L28),\"\")","v":12},{"$f":"IFERROR(IF((M27+N28-M28)>DADOS!$E$5,\"\",M27+N28-M28),\"\")","v":13},{"$f":"IFERROR(IF((N27+O28-N28)>DADOS!$E$5,\"\",N27+O28-N28),\"\")","v":14},{"$f":"IFERROR(IF((O27+P28-O28)>DADOS!$E$5,\"\",O27+P28-O28),\"\")","v":15},{"$f":"IFERROR(IF((P27+Q28-P28)>DADOS!$E$5,\"\",P27+Q28-P28),\"\")","v":16},{"$f":"IFERROR(IF((Q27+R28-Q28)>DADOS!$E$5,\"\",Q27+R28-Q28),\"\")","v":17},{"$f":"IFERROR(IF((R27+S28-R28)>DADOS!$E$5,\"\",R27+S28-R28),\"\")","v":18},{"$f":"IFERROR(IF((S27+T28-S28)>DADOS!$E$5,\"\",S27+T28-S28),\"\")","v":""},{"$f":"IFERROR(IF((T27+U28-T28)>DADOS!$E$5,\"\",T27+U28-T28),\"\")","v":""},{"$f":"IFERROR(IF((U27+V28-U28)>DADOS!$E$5,\"\",U27+V28-U28),\"\")","v":""},{"$f":"IFERROR(IF((V27+W28-V28)>DADOS!$E$5,\"\",V27+W28-V28),\"\")","v":""},{"$f":"IFERROR(IF((W27+X28-W28)>DADOS!$E$5,\"\",W27+X28-W28),\"\")","v":""},{"$f":"IFERROR(IF((X27+Y28-X28)>DADOS!$E$5,\"\",X27+Y28-X28),\"\")","v":""},{"$f":"IFERROR(IF((Y27+Z28-Y28)>DADOS!$E$5,\"\",Y27+Z28-Y28),\"\")","v":""}]
[null,1,{"$f":"IFERROR(IF(B28+1>Apoio!$B$1,\"\",B28+1),\"\")","v":2},{"$f":"IFERROR(IF(C28+1>Apoio!$B$1,\"\",C28+1),\"\")","v":3},{"$f":"IFERROR(IF(D28+1>Apoio!$B$1,\"\",D28+1),\"\")","v":4},{"$f":"IFERROR(IF(E28+1>Apoio!$B$1,\"\",E28+1),\"\")","v":5},{"$f":"IFERROR(IF(F28+1>Apoio!$B$1,\"\",F28+1),\"\")","v":6},{"$f":"IFERROR(IF(G28+1>Apoio!$B$1,\"\",G28+1),\"\")","v":7},{"$f":"IFERROR(IF(H28+1>Apoio!$B$1,\"\",H28+1),\"\")","v":8},{"$f":"IFERROR(IF(I28+1>Apoio!$B$1,\"\",I28+1),\"\")","v":9},{"$f":"IFERROR(IF(J28+1>Apoio!$B$1,\"\",J28+1),\"\")","v":10},{"$f":"IFERROR(IF(K28+1>Apoio!$B$1,\"\",K28+1),\"\")","v":11},{"$f":"IFERROR(IF(L28+1>Apoio!$B$1,\"\",L28+1),\"\")","v":12},{"$f":"IFERROR(IF(M28+1>Apoio!$B$1,\"\",M28+1),\"\")","v":13},{"$f":"IFERROR(IF(N28+1>Apoio!$B$1,\"\",N28+1),\"\")","v":14},{"$f":"IFERROR(IF(O28+1>Apoio!$B$1,\"\",O28+1),\"\")","v":15},{"$f":"IFERROR(IF(P28+1>Apoio!$B$1,\"\",P28+1),\"\")","v":16},{"$f":"IFERROR(IF(Q28+1>Apoio!$B$1,\"\",Q28+1),\"\")","v":17},{"$f":"IFERROR(IF(R28+1>Apoio!$B$1,\"\",R28+1),\"\")","v":18},{"$f":"IFERROR(IF(S28+1>Apoio!$B$1,\"\",S28+1),\"\")","v":""},{"$f":"IFERROR(IF(T28+1>Apoio!$B$1,\"\",T28+1),\"\")","v":""},{"$f":"IFERROR(IF(U28+1>Apoio!$B$1,\"\",U28+1),\"\")","v":""},{"$f":"IFERROR(IF(V28+1>Apoio!$B$1,\"\",V28+1),\"\")","v":""},{"$f":"IFERROR(IF(W28+1>Apoio!$B$1,\"\",W28+1),\"\")","v":""},{"$f":"IFERROR(IF(X28+1>Apoio!$B$1,\"\",X28+1),\"\")","v":""},{"$f":"IFERROR(IF(Y28+1>Apoio!$B$1,\"\",Y28+1),\"\")","v":""}]
[null,{"$f":"IF(OR(B27=\"\",B27=0),\"\",FV(inflacao,B27-1,0,DADOS!$I$5*-1))","v":0},{"$f":"IF(OR(C27=\"\",C27=0),\"\",FV(inflacao,C27-1,0,DADOS!$I$5*-1))","v":0},{"$f":"IF(OR(D27=\"\",D27=0),\"\",FV(inflacao,D27-1,0,DADOS!$I$5*-1))","v":0},{"$f":"IF(OR(E27=\"\",E27=0),\"\",FV(inflacao,E27-1,0,DADOS!$I$5*-1))","v":0},{"$f":"IF(OR(F27=\"\",F27=0),\"\",FV(inflacao,F27-1,0,DADOS!$I$5*-1))","v":0},{"$f":"IF(OR(G27=\"\",G27=0),\"\",FV(inflacao,G27-1,0,DADOS!$I$5*-1))","v":0},{"$f":"IF(OR(H27=\"\",H27=0),\"\",FV(inflacao,H27-1,0,DADOS!$I$5*-1))","v":0},{"$f":"IF(OR(I27=\"\",I27=0),\"\",FV(inflacao,I27-1,0,DADOS!$I$5*-1))","v":0},{"$f":"IF(OR(J27=\"\",J27=0),\"\",FV(inflacao,J27-1,0,DADOS!$I$5*-1))","v":0},{"$f":"IF(OR(K27=\"\",K27=0),\"\",FV(inflacao,K27-1,0,DADOS!$I$5*-1))","v":0},{"$f":"IF(OR(L27=\"\",L27=0),\"\",FV(inflacao,L27-1,0,DADOS!$I$5*-1))","v":0},{"$f":"IF(OR(M27=\"\",M27=0),\"\",FV(inflacao,M27-1,0,DADOS!$I$5*-1))","v":0},{"$f":"IF(OR(N27=\"\",N27=0),\"\",FV(inflacao,N27-1,0,DADOS!$I$5*-1))","v":0},{"$f":"IF(OR(O27=\"\",O27=0),\"\",FV(inflacao,O27-1,0,DADOS!$I$5*-1))","v":0},{"$f":"IF(OR(P27=\"\",P27=0),\"\",FV(inflacao,P27-1,0,DADOS!$I$5*-1))","v":0},{"$f":"IF(OR(Q27=\"\",Q27=0),\"\",FV(inflacao,Q27-1,0,DADOS!$I$5*-1))","v":0},{"$f":"IF(OR(R27=\"\",R27=0),\"\",FV(inflacao,R27-1,0,DADOS!$I$5*-1))","v":0},{"$f":"IF(OR(S27=\"\",S27=0),\"\",FV(inflacao,S27-1,0,DADOS!$I$5*-1))","v":0},{"$f":"IF(OR(T27=\"\",T27=0),\"\",FV(inflacao,T27-1,0,DADOS!$I$5*-1))","v":""},{"$f":"IF(OR(U27=\"\",U27=0),\"\",FV(inflacao,U27-1,0,DADOS!$I$5*-1))","v":""},{"$f":"IF(OR(V27=\"\",V27=0),\"\",FV(inflacao,V27-1,0,DADOS!$I$5*-1))","v":""},{"$f":"IF(OR(W27=\"\",W27=0),\"\",FV(inflacao,W27-1,0,DADOS!$I$5*-1))","v":""},{"$f":"IF(OR(X27=\"\",X27=0),\"\",FV(inflacao,X27-1,0,DADOS!$I$5*-1))","v":""},{"$f":"IF(OR(Y27=\"\",Y27=0),\"\",FV(inflacao,Y27-1,0,DADOS!$I$5*-1))","v":""},{"$f":"IF(OR(Z27=\"\",Z27=0),\"\",FV(inflacao,Z27-1,0,DADOS!$I$5*-1))","v":""}]
[null,{"$f":"IFERROR(B29*12,\"\")","v":0},0,0,0,0,0,0,0,0,0,0,0,0,0,0,0,0,0,"","","","","","",""]
[]
["Filho 4",{"$f":"IF(DADOS!$E$6<=0,0,1)","v":1},{"$f":"IFERROR(IF((B32+C33-B33)>DADOS!$E$6,\"\",B32+C33-B33),\"\")","v":2},{"$f":"IFERROR(IF((C32+D33-C33)>DADOS!$E$6,\"\",C32+D33-C33),\"\")","v":3},{"$f":"IFERROR(IF((D32+E33-D33)>DADOS!$E$6,\"\",D32+E33-D33),\"\")","v":4},{"$f":"IFERROR(IF((E32+F33-E33)>DADOS!$E$6,\"\",E32+F33-E33),\"\")","v":5},{"$f":"IFERROR(IF((F32+G33-F33)>DADOS!$E$6,\"\",F32+G33-F33),\"\")","v":6},{"$f":"IFERROR(IF((G32+H33-G33)>DADOS!$E$6,\"\",G32+H33-G33),\"\")","v":7},{"$f":"IFERROR(IF((H32+I33-H33)>DADOS!$E$6,\"\",H32+I33-H33),\"\")","v":8},{"$f":"IFERROR(IF((I32+J33-I33)>DADOS!$E$6,\"\",I32+J33-I33),\"\")","v":9},{"$f":"IFERROR(IF((J32+K33-J33)>DADOS!$E$6,\"\",J32+K33-J33),\"\")","v":10},{"$f":"IFERROR(IF((K32+L33-K33)>DADOS!$E$6,\"\",K32+L33-K33),\"\")","v":11},{"$f":"IFERROR(IF((L32+M33-L33)>DADOS!$E$6,\"\",L32+M33-L33),\"\")","v":12},{"$f":"IFERROR(IF((M32+N33-M33)>DADOS!$E$6,\"\",M32+N33-M33),\"\")","v":13},{"$f":"IFERROR(IF((N32+O33-N33)>DADOS!$E$6,\"\",N32+O33-N33),\"\")","v":14},{"$f":"IFERROR(IF((O32+P33-O33)>DADOS!$E$6,\"\",O32+P33-O33),\"\")","v":15},{"$f":"IFERROR(IF((P32+Q33-P33)>DADOS!$E$6,\"\",P32+Q33-P33),\"\")","v":16},{"$f":"IFERROR(IF((Q32+R33-Q33)>DADOS!$E$6,\"\",Q32+R33-Q33),\"\")","v":17},{"$f":"IFERROR(IF((R32+S33-R33)>DADOS!$E$6,\"\",R32+S33-R33),\"\")","v":18},{"$f":"IFERROR(IF((S32+T33-S33)>DADOS!$E$6,\"\",S32+T33-S33),\"\")","v":""},{"$f":"IFERROR(IF((T32+U33-T33)>DADOS!$E$6,\"\",T32+U33-T33),\"\")","v":""},{"$f":"IFERROR(IF((U32+V33-U33)>DADOS!$E$6,\"\",U32+V33-U33),\"\")","v":""},{"$f":"IFERROR(IF((V32+W33-V33)>DADOS!$E$6,\"\",V32+W33-V33),\"\")","v":""},{"$f":"IFERROR(IF((W32+X33-W33)>DADOS!$E$6,\"\",W32+X33-W33),\"\")","v":""},{"$f":"IFERROR(IF((X32+Y33-X33)>DADOS!$E$6,\"\",X32+Y33-X33),\"\")","v":""},{"$f":"IFERROR(IF((Y32+Z33-Y33)>DADOS!$E$6,\"\",Y32+Z33-Y33),\"\")","v":""}]
[null,1,{"$f":"IFERROR(IF(B33+1>Apoio!$B$1,\"\",B33+1),\"\")","v":2},{"$f":"IFERROR(IF(C33+1>Apoio!$B$1,\"\",C33+1),\"\")","v":3},{"$f":"IFERROR(IF(D33+1>Apoio!$B$1,\"\",D33+1),\"\")","v":4},{"$f":"IFERROR(IF(E33+1>Apoio!$B$1,\"\",E33+1),\"\")","v":5},{"$f":"IFERROR(IF(F33+1>Apoio!$B$1,\"\",F33+1),\"\")","v":6},{"$f":"IFERROR(IF(G33+1>Apoio!$B$1,\"\",G33+1),\"\")","v":7},{"$f":"IFERROR(IF(H33+1>Apoio!$B$1,\"\",H33+1),\"\")","v":8},{"$f":"IFERROR(IF(I33+1>Apoio!$B$1,\"\",I33+1),\"\")","v":9},{"$f":"IFERROR(IF(J33+1>Apoio!$B$1,\"\",J33+1),\"\")","v":10},{"$f":"IFERROR(IF(K33+1>Apoio!$B$1,\"\",K33+1),\"\")","v":11},{"$f":"IFERROR(IF(L33+1>Apoio!$B$1,\"\",L33+1),\"\")","v":12},{"$f":"IFERROR(IF(M33+1>Apoio!$B$1,\"\",M33+1),\"\")","v":13},{"$f":"IFERROR(IF(N33+1>Apoio!$B$1,\"\",N33+1),\"\")","v":14},{"$f":"IFERROR(IF(O33+1>Apoio!$B$1,\"\",O33+1),\"\")","v":15},{"$f":"IFERROR(IF(P33+1>Apoio!$B$1,\"\",P33+1),\"\")","v":16},{"$f":"IFERROR(IF(Q33+1>Apoio!$B$1,\"\",Q33+1),\"\")","v":17},{"$f":"IFERROR(IF(R33+1>Apoio!$B$1,\"\",R33+1),\"\")","v":18},{"$f":"IFERROR(IF(S33+1>Apoio!$B$1,\"\",S33+1),\"\")","v":""},{"$f":"IFERROR(IF(T33+1>Apoio!$B$1,\"\",T33+1),\"\")","v":""},{"$f":"IFERROR(IF(U33+1>Apoio!$B$1,\"\",U33+1),\"\")","v":""},{"$f":"IFERROR(IF(V33+1>Apoio!$B$1,\"\",V33+1),\"\")","v":""},{"$f":"IFERROR(IF(W33+1>Apoio!$B$1,\"\",W33+1),\"\")","v":""},{"$f":"IFERROR(IF(X33+1>Apoio!$B$1,\"\",X33+1),\"\")","v":""},{"$f":"IFERROR(IF(Y33+1>Apoio!$B$1,\"\",Y33+1),\"\")","v":""}]
[null,{"$f":"IF(OR(B32=\"\",B32=0),\"\",FV(inflacao,B32-1,0,DADOS!$I$6*-1))","v":0},{"$f":"IF(OR(C32=\"\",C32=0),\"\",FV(inflacao,C32-1,0,DADOS!$I$6*-1))","v":0},{"$f":"IF(OR(D32=\"\",D32=0),\"\",FV(inflacao,D32-1,0,DADOS!$I$6*-1))","v":0},{"$f":"IF(OR(E32=\"\",E32=0),\"\",FV(inflacao,E32-1,0,DADOS!$I$6*-1))","v":0},{"$f":"IF(OR(F32=\"\",F32=0),\"\",FV(inflacao,F32-1,0,DADOS!$I$6*-1))","v":0},{"$f":"IF(OR(G32=\"\",G32=0),\"\",FV(inflacao,G32-1,0,DADOS!$I$6*-1))","v":0},{"$f":"IF(OR(H32=\"\",H32=0),\"\",FV(inflacao,H32-1,0,DADOS!$I$6*-1))","v":0},{"$f":"IF(OR(I32=\"\",I32=0),\"\",FV(inflacao,I32-1,0,DADOS!$I$6*-1))","v":0},{"$f":"IF(OR(J32=\"\",J32=0),\"\",FV(inflacao,J32-1,0,DADOS!$I$6*-1))","v":0},{"$f":"IF(OR(K32=\"\",K32=0),\"\",FV(inflacao,K32-1,0,DADOS!$I$6*-1))","v":0},{"$f":"IF(OR(L32=\"\",L32=0),\"\",FV(inflacao,L32-1,0,DADOS!$I$6*-1))","v":0},{"$f":"IF(OR(M32=\"\",M32=0),\"\",FV(inflacao,M32-1,0,DADOS!$I$6*-1))","v":0},{"$f":"IF(OR(N32=\"\",N32=0),\"\",FV(inflacao,N32-1,0,DADOS!$I$6*-1))","v":0},{"$f":"IF(OR(O32=\"\",O32=0),\"\",FV(inflacao,O32-1,0,DADOS!$I$6*-1))","v":0},{"$f":"IF(OR(P32=\"\",P32=0),\"\",FV(inflacao,P32-1,0,DADOS!$I$6*-1))","v":0},{"$f":"IF(OR(Q32=\"\",Q32=0),\"\",FV(inflacao,Q32-1,0,DADOS!$I$6*-1))","v":0},{"$f":"IF(OR(R32=\"\",R32=0),\"\",FV(inflacao,R32-1,0,DADOS!$I$6*-1))","v":0},{"$f":"IF(OR(S32=\"\",S32=0),\"\",FV(inflacao,S32-1,0,DADOS!$I$6*-1))","v":0},{"$f":"IF(OR(T32=\"\",T32=0),\"\",FV(inflacao,T32-1,0,DADOS!$I$6*-1))","v":""},{"$f":"IF(OR(U32=\"\",U32=0),\"\",FV(inflacao,U32-1,0,DADOS!$I$6*-1))","v":""},{"$f":"IF(OR(V32=\"\",V32=0),\"\",FV(inflacao,V32-1,0,DADOS!$I$6*-1))","v":""},{"$f":"IF(OR(W32=\"\",W32=0),\"\",FV(inflacao,W32-1,0,DADOS!$I$6*-1))","v":""},{"$f":"IF(OR(X32=\"\",X32=0),\"\",FV(inflacao,X32-1,0,DADOS!$I$6*-1))","v":""},{"$f":"IF(OR(Y32=\"\",Y32=0),\"\",FV(inflacao,Y32-1,0,DADOS!$I$6*-1))","v":""},{"$f":"IF(OR(Z32=\"\",Z32=0),\"\",FV(inflacao,Z32-1,0,DADOS!$I$6*-1))","v":""}]
[null,{"$f":"IFERROR(B34*12,\"\")","v":0},0,0,0,0,0,0,0,0,0,0,0,0,0,0,0,0,0,"","","","","","",""]
[]
[]
["Estabilização Familiar",{"$f":"IF($B$3<=0,0,1)","v":1},{"$f":"IFERROR(IF((B38+C39-B39)>$B$3,\"\",B38+C39-B39),\"\")","v":2},{"$f":"IFERROR(IF((C38+D39-C39)>$B$3,\"\",C38+D39-C39),\"\")","v":3},4,5,"","","","","","","","","","","","","","","","","","","",""]
[null,1,{"$f":"IFERROR(IF(B39+1>Apoio!$B$3,\"\",B39+1),\"\")","v":2},{"$f":"IFERROR(IF(C39+1>Apoio!$B$3,\"\",C39+1),\"\")","v":3},{"$f":"IFERROR(IF(D39+1>Apoio!$B$3,\"\",D39+1),\"\")","v":4},{"$f":"IFERROR(IF(E39+1>Apoio!$B$3,\"\",E39+1),\"\")","v":5},{"$f":"IFERROR(IF(F39+1>Apoio!$B$3,\"\",F39+1),\"\")","v":""},{"$f":"IFERROR(IF(G39+1>Apoio!$B$3,\"\",G39+1),\"\")","v":""},{"$f":"IFERROR(IF(H39+1>Apoio!$B$3,\"\",H39+1),\"\")","v":""},{"$f":"IFERROR(IF(I39+1>Apoio!$B$3,\"\",I39+1),\"\")","v":""},{"$f":"IFERROR(IF(J39+1>Apoio!$B$3,\"\",J39+1),\"\")","v":""},{"$f":"IFERROR(IF(K39+1>Apoio!$B$3,\"\",K39+1),\"\")","v":""},{"$f":"IFERROR(IF(L39+1>Apoio!$B$3,\"\",L39+1),\"\")","v":""},{"$f":"IFERROR(IF(M39+1>Apoio!$B$3,\"\",M39+1),\"\")","v":""},{"$f":"IFERROR(IF(N39+1>Apoio!$B$3,\"\",N39+1),\"\")","v":""},{"$f":"IFERROR(IF(O39+1>Apoio!$B$3,\"\",O39+1),\"\")","v":""},{"$f":"IFERROR(IF(P39+1>Apoio!$B$3,\"\",P39+1),\"\")","v":""},{"$f":"IFERROR(IF(Q39+1>Apoio!$B$3,\"\",Q39+1),\"\")","v":""},{"$f":"IFERROR(IF(R39+1>Apoio!$B$3,\"\",R39+1),\"\")","v":""},{"$f":"IFERROR(IF(S39+1>Apoio!$B$3,\"\",S39+1),\"\")","v":""},{"$f":"IFERROR(IF(T39+1>Apoio!$B$3,\"\",T39+1),\"\")","v":""},{"$f":"IFERROR(IF(U39+1>Apoio!$B$3,\"\",U39+1),\"\")","v":""},{"$f":"IFERROR(IF(V39+1>Apoio!$B$3,\"\",V39+1),\"\")","v":""},{"$f":"IFERROR(IF(W39+1>Apoio!$B$3,\"\",W39+1),\"\")","v":""},{"$f":"IFERROR(IF(X39+1>Apoio!$B$3,\"\",X39+1),\"\")","v":""},{"$f":"IFERROR(IF(Y39+1>Apoio!$B$3,\"\",Y39+1),\"\")","v":""}]
[null,{"$f":"IF(OR(B38=\"\",B38=0),\"\",FV(inflacao,B38-1,0,DADOS!$C$22*-1))","v":0},{"$f":"IF(OR(C38=\"\",C38=0),\"\",FV(inflacao,C38-1,0,DADOS!$C$22*-1))","v":0},{"$f":"IF(OR(D38=\"\",D38=0),\"\",FV(inflacao,D38-1,0,DADOS!$C$22*-1))","v":0},{"$f":"IF(OR(E38=\"\",E38=0),\"\",FV(inflacao,E38-1,0,DADOS!$C$22*-1))","v":0},{"$f":"IF(OR(F38=\"\",F38=0),\"\",FV(inflacao,F38-1,0,DADOS!$C$22*-1))","v":0},{"$f":"IF(OR(G38=\"\",G38=0),\"\",FV(inflacao,G38-1,0,DADOS!$C$22*-1))","v":""},{"$f":"IF(OR(H38=\"\",H38=0),\"\",FV(inflacao,H38-1,0,DADOS!$C$22*-1))","v":""},{"$f":"IF(OR(I38=\"\",I38=0),\"\",FV(inflacao,I38-1,0,DADOS!$C$22*-1))","v":""},{"$f":"IF(OR(J38=\"\",J38=0),\"\",FV(inflacao,J38-1,0,DADOS!$C$22*-1))","v":""},{"$f":"IF(OR(K38=\"\",K38=0),\"\",FV(inflacao,K38-1,0,DADOS!$C$22*-1))","v":""},{"$f":"IF(OR(L38=\"\",L38=0),\"\",FV(inflacao,L38-1,0,DADOS!$C$22*-1))","v":""},{"$f":"IF(OR(M38=\"\",M38=0),\"\",FV(inflacao,M38-1,0,DADOS!$C$22*-1))","v":""},{"$f":"IF(OR(N38=\"\",N38=0),\"\",FV(inflacao,N38-1,0,DADOS!$C$22*-1))","v":""},{"$f":"IF(OR(O38=\"\",O38=0),\"\",FV(inflacao,O38-1,0,DADOS!$C$22*-1))","v":""},{"$f":"IF(OR(P38=\"\",P38=0),\"\",FV(inflacao,P38-1,0,DADOS!$C$22*-1))","v":""},{"$f":"IF(OR(Q38=\"\",Q38=0),\"\",FV(inflacao,Q38-1,0,DADOS!$C$22*-1))","v":""},{"$f":"IF(OR(R38=\"\",R38=0),\"\",FV(inflacao,R38-1,0,DADOS!$C$22*-1))","v":""},{"$f":"IF(OR(S38=\"\",S38=0),\"\",FV(inflacao,S38-1,0,DADOS!$C$22*-1))","v":""},{"$f":"IF(OR(T38=\"\",T38=0),\"\",FV(inflacao,T38-1,0,DADOS!$C$22*-1))","v":""},{"$f":"IF(OR(U38=\"\",U38=0),\"\",FV(inflacao,U38-1,0,DADOS!$C$22*-1))","v":""},{"$f":"IF(OR(V38=\"\",V38=0),\"\",FV(inflacao,V38-1,0,DADOS!$C$22*-1))","v":""},{"$f":"IF(OR(W38=\"\",W38=0),\"\",FV(inflacao,W38-1,0,DADOS!$C$22*-1))","v":""},{"$f":"IF(OR(X38=\"\",X38=0),\"\",FV(inflacao,X38-1,0,DADOS!$C$22*-1))","v":""},{"$f":"IF(OR(Y38=\"\",Y38=0),\"\",FV(inflacao,Y38-1,0,DADOS!$C$22*-1))","v":""},{"$f":"IF(OR(Z38=\"\",Z38=0),\"\",FV(inflacao,Z38-1,0,DADOS!$C$22*-1))","v":""}]
[null,{"$f":"IFERROR(B40*12,\"\")","v":0},0,0,0,0,"","","","","","","","","","","","","","","","","","","",""]
[]
[]
[]
["Investimento Faculdade",{"$f":"IF(DADOS!C49<=0,0,1)","v":0},{"$f":"IFERROR(IF((B45+C46-B46)>DADOS!$C$49,\"\",B45+C46-B46),\"\")","v":""},{"$f":"IFERROR(IF((C45+D46-C46)>DADOS!$C$49,\"\",C45+D46-C46),\"\")","v":""},{"$f":"IFERROR(IF((D45+E46-D46)>DADOS!$C$49,\"\",D45+E46-D46),\"\")","v":""},{"$f":"IFERROR(IF((E45+F46-E46)>DADOS!$C$49,\"\",E45+F46-E46),\"\")","v":""},{"$f":"IFERROR(IF((F45+G46-F46)>DADOS!$C$49,\"\",F45+G46-F46),\"\")","v":""},{"$f":"IFERROR(IF((G45+H46-G46)>DADOS!$C$49,\"\",G45+H46-G46),\"\")","v":""},{"$f":"IFERROR(IF((H45+I46-H46)>DADOS!$C$49,\"\",H45+I46-H46),\"\")","v":""},{"$f":"IFERROR(IF((I45+J46-I46)>DADOS!$C$49,\"\",I45+J46-I46),\"\")","v":""},{"$f":"IFERROR(IF((J45+K46-J46)>DADOS!$C$49,\"\",J45+K46-J46),\"\")","v":""},{"$f":"IFERROR(IF((K45+L46-K46)>DADOS!$C$49,\"\",K45+L46-K46),\"\")","v":""},{"$f":"IFERROR(IF((L45+M46-L46)>DADOS!$C$49,\"\",L45+M46-L46),\"\")","v":""},{"$f":"IFERROR(IF((M45+N46-M46)>DADOS!$C$49,\"\",M45+N46-M46),\"\")","v":""},{"$f":"IFERROR(IF((N45+O46-N46)>DADOS!$C$49,\"\",N45+O46-N46),\"\")","v":""},{"$f":"IFERROR(IF((O45+P46-O46)>DADOS!$C$49,\"\",O45+P46-O46),\"\")","v":""},{"$f":"IFERROR(IF((P45+Q46-P46)>DADOS!$C$49,\"\",P45+Q46-P46),\"\")","v":""},{"$f":"IFERROR(IF((Q45+R46-Q46)>DADOS!$C$49,\"\",Q45+R46-Q46),\"\")","v":""},{"$f":"IFERROR(IF((R45+S46-R46)>DADOS!$C$49,\"\",R45+S46-R46),\"\")","v":""},{"$f":"IFERROR(IF((S45+T46-S46)>DADOS!$C$49,\"\",S45+T46-S46),\"\")","v":""},{"$f":"IFERROR(IF((T45+U46-T46)>DADOS!$C$49,\"\",T45+U46-T46),\"\")","v":""},{"$f":"IFERROR(IF((U45+V46-U46)>DADOS!$C$49,\"\",U45+V46-U46),\"\")","v":""},{"$f":"IFERROR(IF((V45+W46-V46)>DADOS!$C$49,\"\",V45+W46-V46),\"\")","v":""},{"$f":"IFERROR(IF((W45+X46-W46)>DADOS!$C$49,\"\",W45+X46-W46),\"\")","v":""},{"$f":"IFERROR(IF((X45+Y46-X46)>DADOS!$C$49,\"\",X45+Y46-X46),\"\")","v":""},{"$f":"IFERROR(IF((Y45+Z46-Y46)>DADOS!$C$49,\"\",Y45+Z46-Y46),\"\")","v":""}]
[null,1,{"$f":"IFERROR(IF(B46+1>DADOS!$C$49,\"\",B46+1),\"\")","v":""},{"$f":"IFERROR(IF(C46+1>DADOS!$C$49,\"\",C46+1),\"\")","v":""},{"$f":"IFERROR(IF(D46+1>DADOS!$C$49,\"\",D46+1),\"\")","v":""},{"$f":"IFERROR(IF(E46+1>DADOS!$C$49,\"\",E46+1),\"\")","v":""},{"$f":"IFERROR(IF(F46+1>DADOS!$C$49,\"\",F46+1),\"\")","v":""},{"$f":"IFERROR(IF(G46+1>DADOS!$C$49,\"\",G46+1),\"\")","v":""},{"$f":"IFERROR(IF(H46+1>DADOS!$C$49,\"\",H46+1),\"\")","v":""},{"$f":"IFERROR(IF(I46+1>DADOS!$C$49,\"\",I46+1),\"\")","v":""},{"$f":"IFERROR(IF(J46+1>DADOS!$C$49,\"\",J46+1),\"\")","v":""},{"$f":"IFERROR(IF(K46+1>DADOS!$C$49,\"\",K46+1),\"\")","v":""},{"$f":"IFERROR(IF(L46+1>DADOS!$C$49,\"\",L46+1),\"\")","v":""},{"$f":"IFERROR(IF(M46+1>DADOS!$C$49,\"\",M46+1),\"\")","v":""},{"$f":"IFERROR(IF(N46+1>DADOS!$C$49,\"\",N46+1),\"\")","v":""},{"$f":"IFERROR(IF(O46+1>DADOS!$C$49,\"\",O46+1),\"\")","v":""},{"$f":"IFERROR(IF(P46+1>DADOS!$C$49,\"\",P46+1),\"\")","v":""},{"$f":"IFERROR(IF(Q46+1>DADOS!$C$49,\"\",Q46+1),\"\")","v":""},{"$f":"IFERROR(IF(R46+1>DADOS!$C$49,\"\",R46+1),\"\")","v":""},{"$f":"IFERROR(IF(S46+1>DADOS!$C$49,\"\",S46+1),\"\")","v":""},{"$f":"IFERROR(IF(T46+1>DADOS!$C$49,\"\",T46+1),\"\")","v":""},{"$f":"IFERROR(IF(U46+1>DADOS!$C$49,\"\",U46+1),\"\")","v":""},{"$f":"IFERROR(IF(V46+1>DADOS!$C$49,\"\",V46+1),\"\")","v":""},{"$f":"IFERROR(IF(W46+1>DADOS!$C$49,\"\",W46+1),\"\")","v":""},{"$f":"IFERROR(IF(X46+1>DADOS!$C$49,\"\",X46+1),\"\")","v":""},{"$f":"IFERROR(IF(Y46+1>DADOS!$C$49,\"\",Y46+1),\"\")","v":""}]
[null,{"$f":"IF(OR(B45=\"\",B45=0),\"\",FV(inflacao,DADOS!$E$49+(B45-1),0,DADOS!$B$49*-1))","v":""},{"$f":"IF(OR(C45=\"\",C45=0),\"\",FV(inflacao,DADOS!$E$49+(C45-1),0,DADOS!$B$49*-1))","v":""},{"$f":"IF(OR(D45=\"\",D45=0),\"\",FV(inflacao,DADOS!$E$49+(D45-1),0,DADOS!$B$49*-1))","v":""},{"$f":"IF(OR(E45=\"\",E45=0),\"\",FV(inflacao,DADOS!$E$49+(E45-1),0,DADOS!$B$49*-1))","v":""},{"$f":"IF(OR(F45=\"\",F45=0),\"\",FV(inflacao,DADOS!$E$49+(F45-1),0,DADOS!$B$49*-1))","v":""},{"$f":"IF(OR(G45=\"\",G45=0),\"\",FV(inflacao,DADOS!$E$49+(G45-1),0,DADOS!$B$49*-1))","v":""},{"$f":"IF(OR(H45=\"\",H45=0),\"\",FV(inflacao,DADOS!$E$49+(H45-1),0,DADOS!$B$49*-1))","v":""},{"$f":"IF(OR(I45=\"\",I45=0),\"\",FV(inflacao,DADOS!$E$49+(I45-1),0,DADOS!$B$49*-1))","v":""},{"$f":"IF(OR(J45=\"\",J45=0),\"\",FV(inflacao,DADOS!$E$49+(J45-1),0,DADOS!$B$49*-1))","v":""},{"$f":"IF(OR(K45=\"\",K45=0),\"\",FV(inflacao,DADOS!$E$49+(K45-1),0,DADOS!$B$49*-1))","v":""},{"$f":"IF(OR(L45=\"\",L45=0),\"\",FV(inflacao,DADOS!$E$49+(L45-1),0,DADOS!$B$49*-1))","v":""},{"$f":"IF(OR(M45=\"\",M45=0),\"\",FV(inflacao,DADOS!$E$49+(M45-1),0,DADOS!$B$49*-1))","v":""},{"$f":"IF(OR(N45=\"\",N45=0),\"\",FV(inflacao,DADOS!$E$49+(N45-1),0,DADOS!$B$49*-1))","v":""},{"$f":"IF(OR(O45=\"\",O45=0),\"\",FV(inflacao,DADOS!$E$49+(O45-1),0,DADOS!$B$49*-1))","v":""},{"$f":"IF(OR(P45=\"\",P45=0),\"\",FV(inflacao,DADOS!$E$49+(P45-1),0,DADOS!$B$49*-1))","v":""},{"$f":"IF(OR(Q45=\"\",Q45=0),\"\",FV(inflacao,DADOS!$E$49+(Q45-1),0,DADOS!$B$49*-1))","v":""},{"$f":"IF(OR(R45=\"\",R45=0),\"\",FV(inflacao,DADOS!$E$49+(R45-1),0,DADOS!$B$49*-1))","v":""},{"$f":"IF(OR(S45=\"\",S45=0),\"\",FV(inflacao,DADOS!$E$49+(S45-1),0,DADOS!$B$49*-1))","v":""},{"$f":"IF(OR(T45=\"\",T45=0),\"\",FV(inflacao,DADOS!$E$49+(T45-1),0,DADOS!$B$49*-1))","v":""},{"$f":"IF(OR(U45=\"\",U45=0),\"\",FV(inflacao,DADOS!$E$49+(U45-1),0,DADOS!$B$49*-1))","v":""},{"$f":"IF(OR(V45=\"\",V45=0),\"\",FV(inflacao,DADOS!$E$49+(V45-1),0,DADOS!$B$49*-1))","v":""},{"$f":"IF(OR(W45=\"\",W45=0),\"\",FV(inflacao,DADOS!$E$49+(W45-1),0,DADOS!$B$49*-1))","v":""},{"$f":"IF(OR(X45=\"\",X45=0),\"\",FV(inflacao,DADOS!$E$49+(X45-1),0,DADOS!$B$49*-1))","v":""},{"$f":"IF(OR(Y45=\"\",Y45=0),\"\",FV(inflacao,DADOS!$E$49+(Y45-1),0,DADOS!$B$49*-1))","v":""},{"$f":"IF(OR(Z45=\"\",Z45=0),\"\",FV(inflacao,DADOS!$E$49+(Z45-1),0,DADOS!$B$49*-1))","v":""}]
[null,{"$f":"IFERROR(B47*12,\"\")","v":""},{"$f":"IFERROR(C47*12,\"\")","v":""},"","","","","","","","","","","","","","","","","","","","","","",""]
[]
[]
[]
[]
[]
["Idade","Fator Previdênciario (Homem=35 e Mulher=30)"]
[50,0.57199999999999995]
[51,0.59199999999999997]
[52,0.61299999999999999]
[53,0.63500000000000001]
[54,0.65800000000000003]
[55,0.68200000000000005]
[56,0.70799999999999996]
[57,0.73499999999999999]
[58,0.76400000000000001]
[59,0.79500000000000004]
[60,0.82699999999999996]

{"sheet":"Configuração de Taxas","index":3,"n_rows":15,"n_cols":3,"rows_kept":15,"cut":false,"hidden":false,"merged":[]}
[]
[]
[null,"Idade de Emancipação do filho (em anos):",18]
[]
[null,"Período para Estabilização Familiar (em anos):",5]
[]
[null,"Idade para início da Faculdade (em anos):",18]
[]
[null,"Inflação",0.04]
[null,"IGP-M",0.06]
[null,"IPCA",0.06]
[]
[null,"Rentabilidade no Ano (prev)",7.0000000000000007E-2]
[]
[null,"Taxa de inventário (despesa de inventário)",0.08]